EnvThes
type: ConceptScheme

deprecated concept
type: Concept

terrestrial
type: Concept
is replaced by: https://vocabs.lter-europe.net/elter_cl/10386
deprecated: true
broader: deprecated concept
definition: [Henderson's] a. living or found on land, as opposed to in rivers, lakes or oceans or in the atmosphere.
in scheme: EnvThes
scope note: US LTER controlled vocabulary