EnvThes
type: ConceptScheme

deprecated concept
type: Concept

surveys
type: Concept
deprecated: true
broader: deprecated concept
definition: [GEMET] A critical examination of facts or conditions to provide information on a situation. Usually conducted by interviews and/or on-site visitations.
in scheme: EnvThes
scope note: US LTER controlled vocabulary