EnvThes
type: ConceptScheme

deprecated concept
type: Concept

roads
type: Concept
deprecated: true
broader: deprecated concept
definition: [GEMET] A long piece of hard ground that people can drive along from one place to another.
in scheme: EnvThes
note: [controlled by ] Mark Frenzel, 22 May 2013
scope note: US LTER controlled vocabulary