EnvThes
type: ConceptScheme

deprecated concept
type: Concept

endangered species
type: Concept

endangered species
type: Concept
is replaced by: endangered species
deprecated: true
alternative label: 瀕危物種 @zh
alternative label: specie a rischio @lt
alternative label: gatunek zagrożony @pl
alternative label: espécie ameaçada @pt
alternative label: espèce menacée @fr
alternative label: especie en peligro de extinción @es
alternative label: Utrotningshotad art @sv
broader: deprecated concept
definition: An endangered species is a population of organisms which is at risk of becoming extinct because it is either few in numbers, or threatened by changing environmental or predation parameters. The International Union for Conservation of Nature (IUCN) has calculated the percentage of endangered species as 40 percent of all organisms based on the sample of species that have been evaluated through 2006. Many nations have laws offering protection to conservation reliant species: for example, forbidding hunting, restricting land development or creating preserves. Only a few of the many species at risk of extinction actually make it to the lists and obtain legal protection like Pandas. Many more species become extinct, or potentially will become extinct, without gaining public notice. , "Una especie se considera en peligro de extinción, sea vegetal o animal, cuando se encuentra comprometida su existencia globalmente. Esto se puede deber tanto a la depredación directa sobre la especie como a la desaparición de un recurso del cual esta dependa, tanto por la acción del hombre, debido a cambios en el hábitat, producto de hechos fortuitos o por cambios graduales del clima. En la versión 2009 de la Lista Roja de la UICN 2.448 taxones de animales y 2.280 de plantas se encuentran bajo la categoría 'En Peligro', junto con otros 1.665 taxones de animales y 1.575 de plantas que también lo hacen pero bajo la categoría de 'En peligro crítico'. Muchas naciones cuentan con leyes para proteger a las especies que dependen de su conservación para existir, por ejemplo con la prohibición de su caza. Sin embargo, pocas especies obtienen una protección legal considerable, extinguiéndose muchas sin ningún tipo de reconocimiento público. La extinción de una especie es irreparable y, de momento, irreversible, afectando de manera directa o indirecta a la cadena alimentaria y, eventualmente, al propio ser humano. , "En utrotningshotad art är en art som hotas av utrotning, antingen på grund av att den …
definition: En biologie et écologie, le terme espèce menacée s'applique à toute espèce qui risque de disparaître. @fr
definition: En utrotningshotad art är en art som hotas av utrotning, antingen på grund av att den till antalet är få, eller att den hotas av förändrande miljömässiga eller rovdjursparametrar. Dessa finns ofta med på IUCN:s rödlista, som i Sverige hanteras av ArtDatabanken. IUCN har beräknat att antalet utrotningshotade arter är 40% av alla organismer. Bara en liten andel av det totala antalet beskrivna arter i världen har dock utvärderats av IUCN. Enligt forskare finns det med stor sannolikhet också många hotade arter som människan ännu inte har upptäckt. Många länder äar lagar som erbjuder skydd till arter; de skydden kan vara att förbjuda jakt, fridlysa dem, skapa naturreservat, och så vidare. I Sverige arbetar Naturvårdsverket, ArtDatabanken och länsstyrelserna med Åtgärdsprogram för hotade arter för att försöka bevara dem. Orsaker till att arter blir utrotningshotade är flera, men bland de mest påtagliga är habitatförlust. Även för hård jakt, fiske eller annan typ av fångst eller insamling kan vara orsak till att en art blir utrotningshotad. Den internationella handel med utrotningshotade djur och växter hanteras av CITES. @sv
definition: Gatunek zagrożony – w znaczeniu ogólnym to gatunek w większym lub mniejszym stopniu zagrożony wyginięciem, w wąskim znaczeniu to jedna z kategorii zagrożenia stosowanych do klasyfikacji gatunków zagrożonych wyginięciem. @pl
definition: Si definisce specie a rischio una specie animale o vegetale che, a causa della esiguità della popolazione ed in virtù di sopravvenuti mutamenti nel suo habitat usuale, è a rischio di estinzione. @it
definition: Tiedosto:Status iucn3.1 EN fi. svg Erittäin uhanalainen laji IUCN:n uhanalaisuusluokittelussa. Erittäin uhanalainen laji on eliölaji, jonka vaara kadota luonnosta lähiaikoina on erittäin suuri. Esimerkiksi yksi erittäin uhanalaisista lajeista on gorilla.. Suomessa erittäin uhanalaisia lajeja ovat muun muassa jokihelmisimpukka ja ahma.. Kaiken kaikkiaan vuoden 2000 uhanalaisarvioinnissa luokiteltiin Suomen eliöistä erittäin uhanalaisiksi 5 nisäkäslajia, 6 lintua, 4 kalaa, 242 selkärangatonta, 52 putkilokasvia, 37 itiökasvia ja 106 sienilajia eli yhteensä 452 eliölajia. Kansainvälisen luonnonsuojeluliiton IUCN:n uhanalaisuusluokituksessa erittäin uhanalainen (EN, Endangered) on yksi uhanalaisuuden tasoista., Uhanalaisuus määritellään perinteisesti siten, että eliölajiin tai sen populaatioon kohdistuu lopullisen häviämisen vaara. Lajin uhanalaisuuden arviointi on lajin levinneisyyden, yleisyyden ja runsauden muutosten ennakoimista käytössä olevien tietojen perusteella. Uhanalaisuutta arvioitaessa populaatioiden häviämisnopeus on olennainen tekijä, ja uhanalaisten lajien suojelutyössä häviämisnopeuteen pyritään vaikuttamaan eri keinoin. @fi
definition: Trua arter er arter som trues av utryddelse (står i fare for å dø ut). Trusselbildet kan variere, både mellom artene og innad i en art, herunder også både internasjonalt og nasjonalt. Verdens naturvernunion (IUCN) har derfor utarbeidet ei internasjonal rødliste for bedre å kunne ivareta internasjonale og nasjonale spørsmål om trua arter. Den internasjonale rødlista ivaretas av Species Survival Commission (SSC), mens nasjonale rødlister ivaretas av et lokalt oppnevnt organ., En truet dyreart er en art som av ulike grunner står i fare for å bli utryddet. Mange land har lover som gir spesiell beskyttelse til disse dyreartene (lover som for eksempel kan forby handel og jakt, eller forby utvikling av dyreartenes naturlige habitat og lignende), for å unngå at de blir totalt utryddet. Bare noen få av de mange truede dyreartene kommer på listen og blir gitt beskyttelse ved loven. Mange flere dyrearter blir utryddet, eller vil potensielt bli utryddet, uten å få offentlig oppmerksomhet. At en dyreart havner på en liste over truede dyrearter kan også være en ulempe, siden det gjør dyrearten mer verdifull og ønsket blant samlere og krypskyttere. @no
definition: Uma espécie ameaçada é uma espécie cujas populações estão decrescendo a ponto de colocá-la em risco de extinção. Muitos países têm legislação que protege estas espécies, proibindo a caça e protegendo seus habitats, mas essa legislação tem se demonstrado insuficiente para evitar que um número crescente de espécies deixe de existir, sem que se tenha notícia deste fato. Não há consenso sobre os critérios de inclusão de uma espécie na lista das ameaçadas. Há uma interpretação corrente de que a preservação de espécies ameaçadas é incompatível com a exploração económica do ambiente em que vivem, que deveria ser preservado como um santuário ecológico intocável. Isto é verdade em alguns casos extremos, mas não em todos. Cresce o número de propostas de uso económico sustentável de habitats naturais, combinando agricultura com preservação da cobertura vegetal e portanto da diversidade da flora e da fauna. No Brasil, a legislação tem feito alguns avanços nos últimos anos, embora na prática a falta de fiscalização e a impunidade dos infratores implique em que não seja respeitada. @pt
definition: Una especie se considera en peligro de extinción, sea vegetal o animal, cuando se encuentra comprometida su existencia globalmente. Esto se puede deber tanto a la depredación directa sobre la especie como a la desaparición de un recurso del cual esta dependa, tanto por la acción del hombre, debido a cambios en el hábitat, producto de hechos fortuitos o por cambios graduales del clima. En la versión 2009 de la Lista Roja de la UICN 2.448 taxones de animales y 2.280 de plantas se encuentran bajo la categoría 'En Peligro', junto con otros 1.665 taxones de animales y 1.575 de plantas que también lo hacen pero bajo la categoría de 'En peligro crítico'. Muchas naciones cuentan con leyes para proteger a las especies que dependen de su conservación para existir, por ejemplo con la prohibición de su caza. Sin embargo, pocas especies obtienen una protección legal considerable, extinguiéndose muchas sin ningún tipo de reconocimiento público. La extinción de una especie es irreparable y, de momento, irreversible, afectando de manera directa o indirecta a la cadena alimentaria y, eventualmente, al propio ser humano. @es
definition: 瀕危物種(Endangered species)是指由於濫捕、盜獵、環境破壞、數量稀少、棲地狹窄等種種原因導致有滅絕危機的物種。 一個關鍵物種的滅絕可能破壞當地的食物鏈，造成生態系的不穩定，並可能最終導致整個生態系統的崩解。 @zh
in scheme: EnvThes