EnvThes
type: ConceptScheme

deprecated concept
type: Concept

datalogger
type: Concept
is replaced by: http://vocabs.lter-europe.net/EnvThes/20450
deprecated: true
alternative label: dataloggers
broader: deprecated concept
definition: n. devices/gadgets that record data over time or in relation to location either with a built in instrument or sensor or via external instruments and sensors
in scheme: EnvThes
note: [source of definition ] wikipedia" , "[controlled by ] Neagu Stefan 31/05/13
scope note: US LTER controlled vocabulary