EnvThes
type: ConceptScheme

deprecated concept
type: Concept

accredited potential LTER site / LTSER platform
type: Concept
deprecated: true
broader: deprecated concept
in scheme: EnvThes
scope note: Declaration status acredited by LTER Europe