EnvThes
type: ConceptScheme

deprecated concept
type: Concept

LAI (Leaf Area Index)
type: Concept
deprecated: true
broader: deprecated concept
definition: [Henderson's] of a given area of vegetation, the total area of photosynthetic leaf surface divided by the area of soil covered.
editorial note: concept 'leaf area index' exists
in scheme: EnvThes
scope note: LTER EU controlled vocabulary