EnvThes
type: ConceptScheme

deprecated concept
type: Concept

landscape fragmentation
type: Concept
deprecated: true
broader: deprecated concept
definition: Landscape fragmentation is the result of transforming large habitat patches into smaller, more isolated fragments of habitat.
editorial note: concept 'landscape fragmentation' exists
in scheme: EnvThes