EnvThes
type: ConceptScheme

deprecated concept
type: Concept

landscape cover
type: Concept
deprecated: true
broader: deprecated concept
definition: Land cover is the physical material at the surface of the earth.
in scheme: EnvThes