EnvThes
type: ConceptScheme

soil horizon
type: Concept
narrower: C horizon

C horizon
type: Concept
contributor: 0000-0003-0631-8231
creator: 0000-0003-0631-8231
alternative label: Mineral horizon
alternative label: C layer
broader: soil horizon
definition: [Agren & Andersson 2012] Mineral horizon largely unaffected by soil development.
in scheme: EnvThes
note: [controlled by ] Staszewski 08.06.2013