EnvThes
type: ConceptScheme

layer
type: Concept
narrower: moss layer

moss layer
type: Concept
creator: 0000-0003-0631-8231
broader: layer
definition: [Henderson's] the lowest horizontal ecological stratum of a plant community, comprising the ground surface and its immediate plant cover such as mosses and lichens. alt. ground layer.
in scheme: EnvThes