EnvThes
type: ConceptScheme

layer
type: Concept
narrower: forest layer

forest layer
type: Concept
creator: 0000-0003-0631-8231
broader: layer
definition: A distinct stratum of vegetation within a forest community;
in scheme: EnvThes