EnvThes
type: ConceptScheme

variable
type: Concept
narrower: water velocity

water velocity
type: Concept
alternative label: velocity of water
broader: variable
definition: [ECSO] The velocity of water is the rate of change of its position with respect to a frame of reference, and is a function of time.
in scheme: EnvThes