EnvThes
type: ConceptScheme

variable
type: Concept
narrower: tree diameter at breast height

tree diameter at breast height
type: Concept
creator: https://orcid.org/0000-0003-2195-3997
modified: 2018-11-12
alternative label: diameter at breast height of tree
alternative label: DBH
broader: variable
definition: [ECSO] Domain protocol for measuring the diameter of a tree. Measured at a specified, average distance from the ground, eg 4.5 ft (or average person's breast height). May be measured as circumference, then divided by pi.
in scheme: EnvThes
scope note: MS Academic Keywords