EnvThes
type: ConceptScheme

variable
type: Concept
narrower: suspended solids

suspended solids
type: Concept
modified: 2019-06-12
alternative label: amount of suspended soilds in water
broader: variable
definition: Suspended solids refers to small solid particles which remain in suspension in water as a colloid or due to the motion of the water.
in scheme: EnvThes
scope note: US LTER controlled vocabulary