EnvThes
type: ConceptScheme

variable
type: Concept
narrower: percent carbon

percent carbon
type: Concept
modified: 2019-06-12
alternative label: %C
broader: variable
definition: [ECSO] Percentage of a sample that is carbon
in scheme: EnvThes
scope note: US LTER controlled vocabulary