EnvThes
type: ConceptScheme

variable
type: Concept
narrower: interception

interception
type: Concept
modified: 2019-06-12
alternative label: water interception
broader: variable
definition: p[Wikipedia] Precipitation that does not reach the soil, but is instead intercepted by the leaves and branches of plants and the forest floor./p
in scheme: EnvThes
scope note: US LTER controlled vocabulary