EnvThes
type: ConceptScheme

variable
type: Concept
narrower: global radiation irradiance

global radiation irradiance
type: Concept
alternative label: irradiance of global radiation
broader: variable
definition: Global radiation is the solar radiation reaching the earth's surface on a horizonatl plane
in scheme: EnvThes
scope note: LTER EU controlled vocabulary