EnvThes
type: ConceptScheme

variable
type: Concept
narrower: emergence date

emergence date
type: Concept
alternative label: date of emergence from dormancy
broader: variable
definition: [Wikipedia] Dormancy is a period in an organism's life cycle when growth, development, and (in animals) physical activity are temporarily stopped.
in scheme: EnvThes