EnvThes
type: ConceptScheme

environment
type: Concept
narrower: anthropogenic environment

anthropogenic environment
type: Concept
broader: environment
definition: [ENVO] An anthropogenic environment is an environmental system which is the product of human activity.
in scheme: EnvThes