EnvThes
type: ConceptScheme

التندرة
type: Concept
narrower: alpine tundra
preferred label: Тундра @bg
preferred label: τούνδρα @el
preferred label: tundră @ro
preferred label: tundra
preferred label: toundra @fr
preferred label: Tundra @de
preferred label: toendra @nl

alpine tundra
type: Concept
modified: 2019-06-12
broader: التندرة
definition: [Henderson's] a. appl. the part of a mountain above the tree line and below the permanent snow line, and to species mainly restricted to this zone.
in scheme: EnvThes
note: [controlled by ] Leca Stefan 14.06.2013
scope note: US LTER controlled vocabulary