EnvThes
type: ConceptScheme

grassland
type: Concept
narrower: Savanna
preferred label: 草地 @ja
preferred label: 草原 @zh

Savanna
type: Concept
broader: grassland
definition: [SWEET] A savanna or savannah is a tropical or subtropical woodland ecosystem. Savannas are characterised by the trees being sufficiently small or widely spaced so that the canopy does not close. It is often believed that savannas are characterized by widely spaced, scattered trees, however in many savanna communities tree densities are higher and trees are more regularly spaced than in forest communities. The open canopy allows sufficient light to reach the ground to support an unbroken herbaceous layer consisting primarily of C4 grasses. Savannas are also characterised by seasonal water availability, with the majority of rainfall being confined to one season of the year. Savannas can be associated with several types of biomes. Savannas are frequently seen as a transitional zone, occurring between forest regions and desert regions.
in scheme: EnvThes
scope note: ILTER BIOME