EnvThes
type: ConceptScheme

estuary
type: Concept
broader: marine ecosystem
definition: An estuary is a partly enclosed coastal body of brackish water with one or more rivers or streams flowing into it, and with a free connection to the open sea
in scheme: EnvThes
note: [source of definition ] Pritchard, D. W. (1967). \\"What is an estuary: physical viewpoint\\". In Lauf, G. H. Estuaries. A.A.A.S. Publ. 83. Washington, DC. pp.Ê3Ð5." , "[controlled by ] Mauro Bastianini 6.6.13
scope note: US LTER controlled vocabulary

marine ecosystem
type: Concept
narrower: estuary