EnvThes
type: ConceptScheme

observable property
type: Concept
narrower: thickness

thickness
type: Concept
modified: 2019-06-12
alternative label: thickniss of layer
broader: observable property
definition: [PATO] A 1-D extent quality which is equal to the dimension through an object as opposed to its length or width.
in scheme: EnvThes
scope note: US LTER controlled vocabulary