EnvThes
type: ConceptScheme

derived property
type: Concept
narrower: long term

long term
type: Concept
broader: derived property
definition: 1) Experiment lasting for a relatively long period of time.2) Experiment whose results become effective after a long period of time.
in scheme: EnvThes
scope note: US LTER controlled vocabulary