EnvThes
type: ConceptScheme

observable property
type: Concept
narrower: redox

redox
type: Concept
modified: 2019-06-12
broader: observable property
definition: [Henderson's] a. pert. mutual oxidation and reduction.
in scheme: EnvThes
note: [controlled by ] Staszewski 08.06.2013
scope note: US LTER controlled vocabulary