EnvThes
type: ConceptScheme

water storage
type: Concept
broader: water cycle
definition: Water storage is a term used within agriculture to define locations where water is stored for later use
in scheme: EnvThes
note: [source of definition ] wikipedia" , "[controlled by ] Leca Stefan 14.06.2013

water cycle
type: Concept
narrower: water storage