EnvThes
type: ConceptScheme

biogeochemical process
type: Concept
narrower: energy budget

energy budget
type: Concept
broader: biogeochemical process
definition: [Henderson's] balance of energy input and use in a biological system. It is expressed as consumption (C) = production (P) + respiration (R) + rejecta (faeces and urine) (F + U). see also assimilated energy.
in scheme: EnvThes