EnvThes
type: ConceptScheme

biological process
type: Concept
narrower: brain evolution

brain evolution
type: Concept
creator: https://orcid.org/0000-0003-2195-3997
alternative label: brains evolution
broader: biological process
definition: [Georg F. Striedter] Brain evolution is a complex weave of species similarities and differences, bound by diverse rules and principles...
in scheme: EnvThes
scope note: MS Academic Keywords