EnvThes
type: ConceptScheme

plants
type: Concept
narrower: herbs
preferred label: 植物 @zh

herbs
type: Concept
modified: 2019-06-12
broader: plants
definition: [Henderson's] n. any seed plant with non-woody green stems.
in scheme: EnvThes
note: [controlled by ] Neagu Stefan 07/06/13
scope note: US LTER controlled vocabulary