EnvThes
type: ConceptScheme

animals
type: Concept
narrower: molluscs
preferred label: 動物 @ja
preferred label: 动物 @zh

molluscs
type: Concept
broader: animals
definition: [GEMET] Any of various invertebrates having a soft unsegmented body and often a shell, secreted by a fold of skin.
in scheme: EnvThes
scope note: LTER EU controlled vocabulary