EnvThes
type: ConceptScheme

animals
type: Concept
narrower: macroinvertebrates
preferred label: 動物 @ja
preferred label: 动物 @zh

macroinvertebrates
type: Concept
modified: 2019-06-12
broader: animals
definition: [Henderson's] n. any invertebrate or invertebrate larva whose size is measured in millimetres or centimetres rather than microscopic units. Such species are one of the main groups of organisms sampled in surveys of water quality.
in scheme: EnvThes
scope note: US LTER controlled vocabulary