EnvThes
type: ConceptScheme

animals
type: Concept
narrower: spiders
preferred label: 動物 @ja
preferred label: 动物 @zh

spiders
type: Concept
broader: animals
definition: [GEMET] Any predatory silk-producing arachnid of the order Araneae, having four pairs of legs and a rounded unsegmented body consisting of abdomen and cephalothorax.
in scheme: EnvThes
note: [source of definition ] http://en.wikipedia.org/wiki/Spider
scope note: LTER EU controlled vocabulary