EnvThes
type: ConceptScheme

arthropods
type: Concept
narrower: insects

insects
type: Concept
broader: arthropods
definition: [GEMET] A class of the Arthropoda typically having a segmented body with an external, chitinous covering, a pair of compound eyes, a pair of antennae, three pairs of mouthparts, and two pairs of wings.
in scheme: EnvThes
scope note: US LTER controlled vocabulary