EnvThes
type: ConceptScheme

animals
type: Concept
narrower: domestic animal
preferred label: 動物 @ja
preferred label: 动物 @zh

domestic animal
type: Concept
creator: https://orcid.org/0000-0003-2195-3997
broader: animals
definition: [CRISP] animals which have become adapted through breeding in captivity to a life intimately associated with man; prefer indexing specific animal, treed elsewhere, when possible.
in scheme: EnvThes
scope note: MS Academic Keywords