EnvThes
type: ConceptScheme

fire
type: Concept
narrower: forest fire

forest fire
type: Concept
creator: https://orcid.org/0000-0003-2195-3997
broader: fire
definition: [GEMET] A conflagration in or destroying large wooded areas having a thick growth of trees and plants.
in scheme: EnvThes
scope note: MS Academic Keywords