EnvThes
type: ConceptScheme

tensiometer
type: Concept
broader: mobile sensor
definition: An electrical, electronic, device that automatically identifies changes in soil water potential, a parameter that is related to soil water content
in scheme: EnvThes
note: [controlled by ] Giorgio Matteucci , 30/05/2013" , "[source of definition ] Expert, partly mutuated by GEMET item \\"Detector\\

mobile sensor
type: Concept
narrower: tensiometer