EnvThes
type: ConceptScheme

pesticide application
type: Concept
broader: pest management
definition: Pesticide application refers to the practical way in which pesticides, (including herbicides, fungicides, insecticides, or nematode control agents) are delivered to their biological targets (e.g. pest organism, crop or other plant).
in scheme: EnvThes
preferred label: 農薬施用 @ja
preferred label: 农药喷洒 @zh

pest management
type: Concept
narrower: pesticide application