EnvThes
type: ConceptScheme

sowing
type: Concept
narrower: sowing date

sowing date
type: Concept
broader: sowing
definition: [CO_715] In the form of DDMMYY. Date of sowing in the format MM-DD-YYYY.
in scheme: EnvThes