EnvThes
type: ConceptScheme

observable property
type: Concept
narrower: weight

weight
type: Concept
creator: https://orcid.org/0000-0003-2195-3997
broader: observable property
definition: [ ROO ][ NCIT ]* The vertical force exerted by a mass as a result of gravity.
in scheme: EnvThes