EnvThes
type: ConceptScheme

deprecated concept
type: Concept

solute
type: Concept
deprecated: true
broader: deprecated concept
definition: a solution is a homogeneous mixture composed of only one phase. In such a mixture, a solute is a substance dissolved in another substance, known as a solvent
in scheme: EnvThes