EnvThes
type: ConceptScheme

deprecated concept
type: Concept

regular site
type: Concept
creator: 0000-0003-1068-2394
deprecated: true
broader: deprecated concept
definition: [http://www.lter-europe.net/sites-platforms/categories] In principle, these sites comply with the description of Master LTER Sites, but differ in volume of instrumentation as well as multi use and availability of long-term data across all ecosystem compartments and disciplines.
in scheme: EnvThes
scope note: LTER EU controlled vocabulary